Unnamed: 0,Unnamed: 1,Unnamed: 2,Unnamed: 3,Unnamed: 4,Unnamed: 5,Unnamed: 6,Unnamed: 7,Unnamed: 8,Unnamed: 9,Unnamed: 10,Unnamed: 11,Unnamed: 12,Unnamed: 13,Unnamed: 14,Unnamed: 15,Unnamed: 16,Unnamed: 17,Unnamed: 18,Unnamed: 19,Unnamed: 20,Unnamed: 21,Unnamed: 22,Unnamed: 23,Unnamed: 24,Unnamed: 25,Unnamed: 26,Unnamed: 27,Unnamed: 28,Unnamed: 29,Unnamed: 30,Unnamed: 31,Unnamed: 32,Unnamed: 33,Unnamed: 34,Unnamed: 35,Unnamed: 36,Unnamed: 37,Unnamed: 38,Unnamed: 39,Unnamed: 40,Unnamed: 41,Unnamed: 42,Unnamed: 43,Unnamed: 44,Unnamed: 45,Unnamed: 46,Unnamed: 47,Unnamed: 48,Unnamed: 49,Unnamed: 50,Unnamed: 51,Unnamed: 52,Unnamed: 53,Unnamed: 54,Unnamed: 55,Unnamed: 56,Unnamed: 57,Unnamed: 58,Unnamed: 59,Unnamed: 60,Unnamed: 61,Unnamed: 62,Unnamed: 63,Unnamed: 64,Unnamed: 65,Unnamed: 66,Unnamed: 67,Unnamed: 68,Unnamed: 69,Unnamed: 70,Unnamed: 71,Unnamed: 72,Unnamed: 73,Unnamed: 74,Unnamed: 75,Unnamed: 76,Unnamed: 77,Unnamed: 78,Unnamed: 79,Unnamed: 80
,Demographics,,,,,Lenght of the Disease,,,,,,Symptoms and vital signs at admission,,,,,,,,,,,,,Detailed Comorbidities,,,Radiological test and clinical complications during admission,,,,,,,,,,"Compliance, P/F and VR",,,,,,,Poor prognosis signs,,,,,,First value reported or highest value in blood test (normal value),,,,,,,,,,,,,,,,,,,,Treatments  Received During Admission,,,,,,,,,
,Case,Sex,Age,Nationality,,Total days,Days with symptoms before admission,Days of mechanical ventilation, Admission days,ICU days,,Cough,Fever,Nausea,Dysnea,Diarrhea,Asthenia,Vomiting,Anosmia/Ageusia,Cutaneous Rash,"Admission SpO2, %",Heart Rate (b.p.m),Temperature in Celsius degrees,,Comorbidities,Weight,,Mechanical Ventilation,Pulmonary thromboembolism,Bleeding,Thorax X-Rays,Angio -CT,CT,Thorax X-Rays findings,Renal function during income,"Microbiological isolates, primary  o catheter  related blood stream infection/Ventilator associated pneumonia/Urinary tract infection",,Initial Compliance ,Initial P/F ,Initial VR ,Final Compliance ,Final P/F  ,Final VR ,,IL6 >40,D-Dimer >2000,Lymphopenia,Anemia,LDH >500,,White cell count /µL (4-11 x 10^3),% Neutrophils,Lymphocytes/µL (1-4.5 x 10^3)),Creatinine mg/dL (0.3-1.3),CRP mg/L (0-5),Ferritin ng/mL (20-300),Lactate dehydrogenase U/L (140-240),Platelets/µL (140-400 x 10^3),Fibrinogen mg/dl (150-400),APTT % (76-128),PT  s(9.7-12.6),D-dimer ng/mL (0-500),Troponine I ng/ml (0-0.1),Highest Troponine Ing/ml (0-0.1),Natriuretc peptide pGg/mL ,IL6 pg/mL,Highest IL6 pg/mL,Highest IL10 pg/mL,Highest IL12 pg/mL,,Fibrinolytic,Hydroxychloroquine,Azitromicine,Kaletra,Betaferon,Tocilizumab,Heparine,Steroids,Antibiotics,Fungicide
,1,Female,77,Spanish,,9,0,0,9,0,,No,No,No,Yes,No,No,No,No,No,97,87,36.5,,"Colecistectomy, Peritoneal carcinomatosis, ,Hypertension, Dyslipemia, Psoriasis",73,,No,No,No,Yes,No,No,Normal,Impaired kidney function,No,,Not ICU,,,,,,,Yes,NR,Yes,Yes,No,,21.9,93.9,0.73,0.92,263.9,NR,233,599,740,97.6,12,NR,NR,NR,53,87.76,87.76,13.07,NR,,No,No,No,No,No,Yes,Yes,Yes,Yes,Yes
,2,Female,91,Spanish,,10,1,0,9,0,,Yes,No,No,No,No,No,Yes,No,No,97,141,36.8,,"Dementia, Hypertension, Heart failure",65,,No,Yes,Digestive,Yes,No,Abdomen,Bilateral Consolidation opacities,Impaired kidney function,No,,Not ICU,,,,,,,NR,NR,Yes,No,No,,7.84,68.98,1.37,0.98,48,142.95,305,219,566.2,102.9,11.1,NR,0.5,0.5,168,NR,NR,NR,NR,,No,Yes,No,No,No,No,Yes,No,Yes,No
,3,Male,80,Spanish,,13,5,0,8,0,,No,Yes,No,Yes,No,Yes,No,No,No,87,114,36.2,,"Urothelial carcinoma, Auricular fibrilation, Hypertension, Cardiomyopathy,  Chronic obstructive pulmonay disease",66,,No,No,No,Yes,No,No,Bilateral Consolidation opacities,Normal,No,,Not ICU,,,,,,,No,Yes,Yes,Yes,Yes,,15.2,90.3,0.47,0.64,284.4,1578.57,270,479,740,16.1,49.2,766,0,0,62.9,1.27,1.27,0.5,0.5,,No,No,Yes,No,No,No,No,Yes,Yes,Yes
,4,Female,83,Spanish,,14,11,0,3,0,,No,No,No,Yes,No,No,No,No,No,79,112,35.5,,Frontotemporal dementia,53,,No,No,No,Yes,No,No,Bilateral Consolidation opacities,Normal,No,,Not ICU,,,,,,,NR,Yes,No,Yes,No,,18.9,90.7,1.37,1.05,233,NR,343,216,539.3,67.8,13.4,7002,0.3,0.3,1954.3,NR,NR,NR,NR,,No,Yes,Yes,No,No,No,No,No,Yes,No
,5,Male,58,Spanish,,16,4,12,12,12,,No,Yes,No,No,No,No,No,No,No,94,120,NR,,Diabetes Mellitus,NR,,Yes,No,No,Yes,"Yes, brain",No,Bilateral Consolidation opacities,Normal,No,,35,200,1.8,22,79,4.5,,NR,Yes,Yes,Yes,Yes,,13.1,89.1,0.61,0.99,10.3,NR,453,118,367.3,94.9,11.7,343,NR,NR,48.7,NR,NR,NR,NR,,No,No,No,No,No,No,Yes,Yes,Yes,Yes
,6,Male,69,Chilean,,19,3,16,18,17,,Yes,Yes,No,Yes,No,Yes,No,No,No,78,96,36.3,,"Essential Tremor, Ischemic cardiopathy, Diabetes Mellitus, Chronic renal disease, Dyslipemia, Hypertension",NR,,Yes,Yes,No,Yes,Yes,"Thorax, abdomen",Bilateral peripheral ground glass opacities,Normal,"Escherichia Coli, Klebsiella Blee, Aspergillus NOS",,33,235,1.9,20,77,4.6,,No,Yes,Yes,Yes,Yes,,8.11,75.7,1.55,1.02,220.4,NR,724,205,740,109.9,10.9,3756,0,0,NR,8.8,8.8,0.5,NR,,No,No,No,No,No,No,Yes,Yes,Yes,Yes
,7,Male,70,Spanish,,25,3,10,22,13,,Yes,No,Yes,No,Yes,Yes,No,Yes,No,96,100,36.6,,"Diabetes Mellitus, dyslipemia, hypothyroidism, Coxartrosis",90,,Yes,No,No,Yes,No,No,Bilateral Consolidation opacities,Impaired kidney function,"Streptococcus Parasanguinis, Klebsiella Aerogenes, enterobacter cloacae ",,27,118,1.7,34,50,3.1,,Yes,Yes,Yes,Yes,Yes,,3.84,70.6,0.79,0.83,159.4,516.34,430,180,740,89.4,12.7,572,0,0,31.8,69.62,6997.74,4.48,0.5,,No,No,Yes,No,No,Yes,Yes,Yes,Yes,Yes
,8,Male,69,Spanish,,25,3,22,22,22,,No,Yes,No,Yes,No,No,No,No,No,90,150,36.5,,"Ischemic cardiopathy, Dyslipemia",NR,,Yes,Yes,No,Yes,Yes,Thorax,Bilateral peripheral ground glass opacities,"Impaired kidney function, dialisys","Staphylococcus  Aureus, Aspergillus NOS",,34,116,1.6,32,45,3.8,,Yes,NR,Yes,Yes,Yes,,16.8,86.4,1.26,1.6,311.15,NR,537,233,740,48.6,17.4,NR,0,0.1,57.6,1304.5,1304.5,47.75,0,,Yes,No,No,No,No,Yes,Yes,Yes,Yes,Yes
,9,Male,70,Spanish,,26,14,12,12,12,,No,Yes,No,Yes,No,Yes,No,No,No,88,NR,36.3,,Hypertension,75,,Yes,No,No,Yes,Yes,No,Bilateral peripheral ground glass opacities,Impaired kidney function,Staphtlococcus Aureus ,,40,97,1.2,20,100,3,,Yes,Yes,Yes,Yes,Yes,,5.29,83.9,0.54,1.1,147,NR,683,162,740,93.3,11.8,682,0,0,45.6,7.4,44.8,8.5,NR,,No,No,No,No,No,Yes,Yes,Yes,Yes,Yes
,10,Female,70,Spanish,,27,8,15,19,15,,Yes,Yes,No,Yes,No,Yes,No,Yes,No,93,NR,36,,No,62,,Yes,No,No,Yes,No,No,Bilateral Consolidation opacities,Normal,No,,40,300,1.3,18,55,2,,Yes,Yes,Yes,Yes,Yes,,4.14,85,0.41,0.78,116,NR,514,112,740,109.9,10,512,NR,NR,42.9,9.6,285.1,2.6,NR,,No,No,No,No,No,Yes,Yes,Yes,Yes,Yes
,11,Female,56,Spanish,,27,9,17,18,17,,No,Yes,Yes,Yes,Yes,Yes,Yes,No,No,86,NR,35.7,,Obesity,78,,Yes,Yes,No,Yes,Yes,No,Bilateral peripheral ground glass opacities,Normal,No,,36,68,1.4,18,80,3.1,,Yes,Yes,Yes,Yes,Yes,,5.11,68.8,1.33,0.7,75.5,1093.66,603,124,740,87.1,12.2,697,10.4,10.4,160.5,69.2,2257.6,7.6,NR,,No,No,No,No,No,Yes,Yes,Yes,Yes,Yes
,12,Male,73,Spanish,,29,10,16,19,18,,No,No,No,Yes,No,Yes,No,No,No,73,100,36.1,,"Fat liver, Hypertension, Gout,  Chronic obstructive pulmonay disease",NR,,Yes,No,No,Yes,No,No,Bilateral Consolidation opacities,Normal,Aspergillus NOS,,30,90,1.6,26,95,2.4,,No,Yes,Yes,Yes,Yes,,3.22,62.6,0.88,1.21,64,NR,573,142,662.4,102,11.3,916,0,0,10,36,36,6.2,NR,,Yes,No,No,No,No,Yes,Yes,Yes,Yes,Yes
,13,Female,60,Bolivian,,32,3,19,29,19,,Yes,Yes,Yes,Yes,No,No,No,No,No,90,110,36.1,,No,60,,Yes,No,Cerebral,Yes,No,No,Bilateral Consolidation opacities,Normal,"Pseudomona Aeruginosa, Enterococcus Faecalis, Candida albicans",,12,45,2.9,5,61,2.1,,Yes,Yes,Yes,Yes,Yes,,11.8,86.8,1.07,0.87,232.3,1436.35,600,257,740,91.1,11.7,727,0,0.2,121.5,13.9,3091.88,6.23,1.22,,No,Yes,No,Yes,No,Yes,Yes,Yes,Yes,Yes
,14,Male,68,Spanish,,32,14,12,18,12,,Yes,Yes,No,Yes,No,No,No,No,No,90,88,36.1,,"Colelithiasis, former smoker , dyslipemia, Stroke for carotid embolism",91,,Yes,No,No,Yes,No,Craneal,Bilateral peripheral ground glass opacities,Normal,"Enterococcus Faecalis, Aspergillus flavus, Candida Parapsilosis",,10,131,2,19,97,2.1,,Yes,Yes,Yes,Yes,Yes,,1.45,70.2,0.28,1.07,63.8,1880.36,279,92.8,740,77.6,13.7,757,0,0,156.1,57.33,462.66,7.83,NR,,No,No,Yes,Yes,No,Yes,Yes,Yes,Yes,Yes
,15,Male,72,Spanish,,34,8,37,26,25,,Yes,Yes,No,No,No,Yes,No,No,No,85,98,39,,"Bladder carcinoma, Ischemic cardiopathy, Auricular Flutter, Dyslipemia, Hypertension",73,,Yes,Yes,No,Yes,Yes,Craneal,Bilateral peripheral ground glass opacities,Impaired kidney function,"Klebsiella BLEE, Candida parasilopsis,  Cytomegalovirus",,20,86,1.6,13,100,2,,Yes,Yes,Yes,Yes,Yes,,13.2,87,1.09,1.45,228.7,656.66,416,144,740,73,13.9,911,0,1,169.8,78.3,78.3,15.98,NR,,No,No,No,No,No,Yes,Yes,Yes,Yes,Yes
,16,Male,62,Spanish,,35,8,15,27,15,,No,Yes,No,No,No,No,No,No,No,70,NR,NR,,"Hypertension, dylipemia, hyperuricemia",98,,Yes,Yes,No,Yes,No,No,Bilateral Consolidation opacities,"Impaired kidney function, dialisys",Hafnia Alvei ,,15,36,3.3,26,60,2,,Yes,Yes,Yes,Yes,Yes,,4.02,67.8,1.04,1.09,99.7,416.68,313,183,740,89.3,11.8,258,0,0.1,78.1,149.71,2052.3,6.6,2.9,,No,Yes,Yes,No,No,Yes,Yes,Yes,Yes,No
,17,Male,54,Spanish,,36,10,22,26,23,,Yes,Yes,No,Yes,No,Yes,No,No,No,80,116,36.5,,"Obesity, Hypertension, Migraine, Gout, Smoker, Chronic obstructive pulmonay disease",100,,Yes,Yes,Oropharyngeal,Yes,Yes,No,Bilateral Consolidation opacities,Impaired kidney function,No,,60,194,1.14,54,105,2.1,,Yes,Yes,Yes,Yes,Yes,,8.85,84.7,0.95,1.41,241,2741.18,500,366,740,100.8,11.2,6978,0,0.1,396.1,25.15,1285,9.25,1.12,,No,Yes,No,Yes,No,Yes,Yes,Yes,Yes,No
,18,Male,70,Spanish,,36,4,30,32,30,,Yes,Yes,No,No,No,No,No,No,No,96,108,37.2,,"Hydrocele, Venous insufficiency",82,,Yes,No,No,Yes,Yes,No,Bilateral peripheral ground glass opacities,Impaired kidney function,"Klebsiella Blee, enterococcus Faecalis, Klebsiella Pneumonie, Candida glabrata ",,33,228,1.6,13,90,2.9,,Yes,Yes,Yes,Yes,Yes,,13.2,91.8,0.71,1.14,181.3,1571.23,255,188,740,85.4,12.6,1805,0,0,0.47,57.08,57.08,11.13,0.5,,No,No,Yes,No,No,Yes,Yes,Yes,Yes,Yes
,19,Male,55,Spanish,,37,7,19,30,30,,Yes,Yes,No,Yes,No,No,No,No,No,80,NR,NR,,No,75,,Yes,Yes,No,Yes,Yes,No,Bilateral Consolidation opacities,"Impaired kidney function, dialisys","Staphylococcus Aureus,  Aspergillus fumigatus, Aspergillus flavus, Aspergillus terreus",,71,250,3.6,48,134,1.4,,Yes,Yes,Yes,Yes,Yes,,13,88.5,0.99,0.97,348.8,NR,693,435,740,66.9,13.5,14992,0.1,0.5,133.6,215.61,538.77,12.1,1.19,,No,Yes,Yes,Yes,No,Yes,Yes,Yes,Yes,No
,20,Male,71,Spanish,,38,5,26,33,32,,No,Yes,Yes,No,No,Yes,No,No,No,81,83,37,,Obesity,100,,Yes,No,Soft Tissues,Yes,No,"Thorax, Abdomen",Bilateral Consolidation opacities,Normal,Candida Glabrata ,,45,70,1.5,15,82,2.2,,Yes,Yes,Yes,Yes,Yes,,5.85,76,0.78,0.82,89.7,2163.03,372,120,740,80.4,12.3,517,0,0.3,41.7,60.67,180.53,2.65,2.44,,No,Yes,Yes,Yes,No,Yes,Yes,Yes,Yes,Yes
,21,Male,55,Peruvian,,40,7,0,33,19,,No,Yes,No,Yes,No,Yes,No,No,No,84,76,36.4,,"Diabetes mellitus, Dyslipemia,",70,,Yes,No,No,Yes,Yes,No,Bilateral Consolidation opacities,Normal,"Klebsiella Pneumoniea, Candida Albicans",,Not ICU,,,,,,,Yes,Yes,Yes,Yes,Yes,,17.2,92,0.89,0.75,271,1120.23,581,180,740,131.3,10.2,1168,0,0,29.1,22.86,3900,9,NR,,Yes,No,No,No,No,Yes,Yes,Yes,Yes,Yes
,22,Male,69,Colombian,,41,11,14,30,29,,Yes,Yes,No,Yes,Yes,Yes,No,No,No,83,88,36.4,,Hypertension,80,,Yes,No,No,Yes,No,No,Bilateral Consolidation opacities,"Impaired kidney function, dialisys","Pseudomona Aeruginosa, Enterococcus Faecalis ",,41,244,1.8,15,107,2.5,,Yes,Yes,Yes,Yes,Yes,,7.68,89.9,0.55,0.86,247,1988.05,736,219,740,91.1,11.7,1160,0,0,86.9,176.3,14493.41,54.44,6.66,,No,Yes,Yes,Yes,No,Yes,Yes,Yes,Yes,np
,23,Female,56,Peruvian,,41,10,24,31,24,,NR,NR,NR,NR,NR,NR,NR,NR,NR,85,NR,NR,,Alcoholism,70,,Yes,No,No,Yes,No,No,Bilateral peripheral ground glass opacities,Normal,"Stenotrophomonas Matltophilia, Candida albicans ",,40,132,2.2,18,86,3.1,,Yes,Yes,Yes,Yes,Yes,,16.6,84.7,1.24,0.52,457.1,59.15,307,479,613.4,117,11.1,3093,0,0,105.2,558,558,3,0,,No,No,No,Yes,Yes,Yes,Yes,Yes,Yes,Yes
,24,Male,76,Spanish,,41,13,12,28,18,,Yes,No,No,Yes,No,Yes,No,Yes,No,95,108,36.1,,"Hypertension, Dyslipemia, Chronic obstructive pulmonay disease",100,,Yes,No,No,Yes,No,"Thorax ,Abdomen",Bilateral peripheral ground glass opacities,"Impaired kidney function, dialisys",Aspergillus flavus,,47,96,0.9,23,58,2.8,,Yes,Yes,Yes,Yes,Yes,,4.83,69.7,1.05,1.33,188.2,3879.26,519,148,740,80.1,12.6,1482,0,7.4,67.8,26.8,1456.8,5.58,0.75,,No,No,Yes,No,No,Yes,Yes,Yes,Yes,Yes
,25,Male,76,Spanish,,43,5,18,38,19,,No,Yes,No,No,No,No,No,No,No,99,70,36.7,,"Hypertrophic myocardiopathy, postatic adenocarcinoma in 2002",74,,Yes,Yes,Alveolar,Yes,No,No,Bilateral Consolidation opacities,normal,"Bacterioides spp, Enterococcus  Faecium, Staphylococcus Aureus, Candida glabrata. ",,26,87,2.4,60,106,2.55,,Yes,Yes,Yes,Yes,Yes,,14.5,96.9,0.22,0.72,133.1,1680.01,672,202,740,76.7,12.6,8293,0,0.4,2288,589,7893.67,10.43,5.23,,No,Yes,Yes,Yes,No,Yes,Yes,Yes,Yes,No
,26,Male,63,Spanish,,45,8,31,37,36,,No,Yes,No,Yes,No,No,No,No,No,95,95,36.7,,"Ischemic Cardiopathy, Valvular replacemente, Chronic obstructive pulmonay disease. ",80,,Yes,Yes,No,Yes,Yes,"Thorax, Abdomen, Craneal, Coronary",Bilateral Consolidation opacities,Normal,Candida albicans  S.gallotycus,,25,135,4,31,100,2.9,,No,Yes,Yes,Yes,Yes,,12.6,87.4,0.65,0.48,36.4,1454.01,454,184,367.7,70.6,12.4,9693,0.1,3,866.8,23.83,189.2,8.7,1,,Yes,Yes,Yes,Yes,No,Yes,Yes,Yes,Yes,No
,27,Male,78,Spanish,,46,4,36,42,39,,Yes,Yes,No,Yes,No,Yes,No,No,No,77,83,36.6,,"Dyslipemia, Prostatic hyperplasia",82,,Yes,No,No,Yes,No,Abdomen,Bilateral peripheral ground glass opacities,Normal,"Pseudomona Aeruginosa, Staphylococcus Epidermis, Pseudomona Aeruginosa, Staphylococcus Haemolyticus",,53,59,1.9,19,110,2.2,,Yes,Yes,Yes,Yes,Yes,,3.12,69.8,0.58,1.27,156.4,5269.9,658,120,740,99.4,11.4,655,0,0.2,47.7,35.9,386.2,2.7,0.5,,No,No,No,No,No,Yes,Yes,Yes,Yes,Yes
,28,Male,56,Spanish,,47,0,25,47,26,,No,Yes,No,No,Yes,No,No,No,Yes,98,75,38,,"Idiopathic myelofibrosis, acute leukemia, ischemic cardiopathy, Hypertension",73.5,,Yes,No,No,Yes,No,No,Normal,Normal,"Escherichia coli,  Clostridium difficile, Klebsiella Blee ",,21,158,2.1,20,135,5.2,,Yes,Yes,Yes,Yes,Yes,,0.01,18.2,0,0.86,9.3,2494.3,503,22.3,295.1,76.7,12.6,628,0,0,81.8,133.6,1842.62,4.6,0.26,,No,Yes,Yes,Yes,Yes,No,Yes,Yes,Yes,Yes
,29,Male,66,Spanish,,49,15,19,34,24,,Yes,Yes,No,Yes,No,No,No,Yes,No,89,102,36.5,,"Hypothyroidism, Dyslipemia",80,,Yes,No,No,Yes,Yes,No,Bilateral Consolidation opacities,Normal,"Candida albicans, Enterococcus Faecium",,31,57,1.2,45,73,1.6,,Yes,Yes,Yes,Yes,Yes,,10.4,76.2,1.45,0.88,237.3,795.93,534,379,740,83.5,12.1,1325,0,0,153.14,153.14,4739,11.35,4.45,,No,Yes,No,Yes,No,Yes,Yes,Yes,Yes,Yes
,30,Male,52,Spanish,,57,7,50,50,50,,Yes,Yes,No,Yes,No,No,No,No,No,81,125,36,,"Obesity, Hypertension, Chronic obstructive pulmonay disease",109,,Yes,No,No,Yes,Yes,"Thorax, Abdomen",Bilateral peripheral ground glass opacities,Impaired kidney function,"Klebsiella Blee, Pseudomona Libaniensis,Apergillus  Terreus, Candida parapsilopsis, enterococcus faecalis. ",,40,80,2,18,70,2.6,,Yes,Yes,Yes,Yes,Yes,,15.2,88,0.96,2.82,238.8,666.91,987,223,740,84.3,12.1,1566,0.8,1.2,19,137.28,2688.22,8.04,1.41,,No,No,Yes,No,Yes,No,Yes,Yes,Yes,Yes
,31,Male,70,Spanish,,66,7,43,59,54,,No,Yes,No,Yes,No,No,No,No,No,94,100,36.3,,"Prostatic hyperplasia, Palidromic rheumatism, Chronic obstructive pulmonay disease",NR,,Yes,No,No,Yes,Yes,Thorax,Bilateral Consolidation opacities,Normal,"Staphylococcus Auerus , Aspergillus NOS, Satphylococcus Epidermis.",,38,155,1.26,15,77,3.5,,Yes,Yes,Yes,Yes,Yes,,9.33,80.6,0.61,0.72,105.4,906.02,323,119,740,93.3,11.8,532,0,0,19.4,21.5,135.3,3.12,NR,,No,No,Yes,Yes,No,Yes,Yes,Yes,Yes,Yes
,32,Male,73,Spanish,,74,5,49,69,49,,Yes,Yes,No,Yes,No,No,No,No,No,88,90,37.3,,Dyslipemia,80,,Yes,No,No,Yes,Yes,No,Bilateral peripheral ground glass opacities,Normal,"Cytomegalovirus,  Stenotrophomonas maltophilia, Chryseobacterium indologenes,  enterococcus faecalis",,35,200,1.5,14,83,4,,Yes,Yes,Yes,Yes,Yes,,5.46,67.9,1.38,0.92,64.6,1045.49,378,104,586.8,96.7,11.4,759,0,0,23.4,34.4,476.6,7.7,5,,No,No,Yes,Yes,Yes,No,Yes,Yes,Yes,Yes
,33,Male,62,Spanish,,108,6,95,102,95,,Yes,Yes,No,Yes,No,No,No,No,No,88,115,37.7,,Dyslipemia,70,,Yes,No,No,Yes,No,"Thorax, Abdomen",Bilateral peripheral ground glass opacities,Impaired kidney function,"Klebsiella BLEE, Serratia marcescens, Enterococcus faecalis, Klebsiella Pneumonie, Enterococcus Faecium, Burkholderia Cepacia",,42,90,3.3,17,130,3.8,,Yes,Yes,Yes,Yes,Yes,,15.8,90.6,0.89,1.25,491.1,3909.58,497,222,740,70.8,13.1,1634,0,0,NR,121.5,696.49,18.74,2.66,,No,Yes,Yes,Yes,No,Yes,Yes,Yes,Yes,Yes
